``` K:\java\mobibot\src\main\java\net\thauvin\erik...
# kobalt
e
Copy code
K:\java\mobibot\src\main\java\net\thauvin\erik\mobibot\Mobibot.java:49: error: package org.junit does not exis
import org.junit.runner;                                                                                      
                ^                                                                                             
K:\java\mobibot\src\main\java\net\thauvin\erik\mobibot\Mobibot.java:59: error: cannot find symbol             
@RunWith                                                                                                      
 ^                                                                                                            
  symbol: class RunWith                                                                                       
2 errors                                                                                                      
:compileAnnotationProcessor FAILED                                                                            
                                                                                                              
FAILURE: Build failed with an exception.                                                                      
                                                                                                              
* What went wrong:                                                                                            
Execution failed for task ':compileAnnotationProcessor'.                                                      
> Compilation failed; see the compiler error output for details.                                              
                                                                                                              
* Try:                                                                                                        
Run with --stacktrace option to get the stack trace. Run with --info or --debug option to get more log output.
                                                                                                              
BUILD FAILED