PHondogo
09/08/2026, 9:30 PM* What went wrong:
Execution failed for task ':project:compileKotlinJvm'.
> A failure occurred while executing org.jetbrains.kotlin.compilerRunner.btapi.BuildToolsApiCompilationWork
> Kotlin compiler error
Kotlin compiler error
warnings found and -Werror specified
// And then huge stack trace without valuable info. There is root cause part:
Caused by: org.jetbrains.kotlin.gradle.tasks.CompilationErrorException: warnings found and -Werror specified
at org.jetbrains.kotlin.gradle.plugin.diagnostics.DefaultCompilerDiagnosticsProblemsReporter.reportCompilerMessage(CompilerDiagnosticsProblemsReporter.kt:63)
at org.jetbrains.kotlin.compilerRunner.btapi.ProblemsApiCompilerMessageRenderer.replayTo(ProblemsApiCompilerMessageRenderer.kt:88)Vampire
09/08/2026, 9:58 PMPHondogo
09/08/2026, 10:38 PM> Task :project:compileKotlinJvm FAILED
Problem found: Kotlin compiler error (id: kotlin:compiler:error:compiler-error)
Kotlin compiler error
warnings found and -Werror specified
[Incubating] Problems report is available at: file:///home/user/project/build/reports/problems/problems-report.html
279 actionable tasks: 101 executed, 178 up-to-date
Configuration cache entry reused.
FAILURE: Build failed with an exception.PHondogo
09/08/2026, 10:39 PMVampire
09/09/2026, 6:29 AMVampire
09/09/2026, 6:30 AMPHondogo
09/09/2026, 6:32 AMPHondogo
09/09/2026, 6:33 AMVampire
09/09/2026, 6:59 AM--scan URL?PHondogo
09/09/2026, 7:06 AMtapchicoma
09/10/2026, 3:51 PM